Butanedioic acid, dimethyl ester
- Formula: C6H10O4
- Molecular weight: 146.1412
- IUPAC Standard InChIKey: MUXOBHXGJLMRAB-UHFFFAOYSA-N
- CAS Registry Number: 106-65-0
- Chemical structure:
View 3d structure (requires JavaScript / HTML 5) - Other names: Succinic acid, dimethyl ester; Dimethyl butanedioate; Dimethyl succinate; Methyl succinate; CH3OC(O)CH2CH2C(O)OCH3; Dimethyl ester of succinic acid; DBE-4

Phase change data

Data compiled as indicated in comments:
BS - Robert L. Brown and Stephen E. Stein
TRC - Thermodynamics Research Center, NIST Boulder Laboratories, Chris Muzny director
AC - William E. Acree, Jr., James S. Chickos
Quantity | Value | Units | Method | Reference | Comment |
---|---|---|---|---|---|
Tboil | 470. ± 3. | K | AVG | N/A | Average of 8 values; Individual data points |
Quantity | Value | Units | Method | Reference | Comment |
Tfus | 292. ± 1. | K | AVG | N/A | Average of 11 values; Individual data points |
Quantity | Value | Units | Method | Reference | Comment |
ΔvapH° | 61.0 ± 0.3 | kJ/mol | GS | Verevkin, Kozlova, et al., 2006 | Based on data from 286. to 340. K.; AC |
ΔvapH° | 61.7 ± 0.4 | kJ/mol | N/A | Katayama, 1992 | Based on data from 342. to 468. K. See also Verevkin, Kozlova, et al., 2006.; AC |
ΔvapH° | 60.9 ± 0.4 | kJ/mol | EB | Daubert, Jalowka, et al., 1987 | Based on data from 367. to 460. K. See also Verevkin, Kozlova, et al., 2006.; AC |
ΔvapH° | 62.4 | kJ/mol | EB | Vlasov, Granzhan, et al., 1963 | Based on data from 398. to 468. K. See also Verevkin, Kozlova, et al., 2006.; AC |
Reduced pressure boiling point
Tboil (K) | Pressure (bar) | Reference | Comment |
---|---|---|---|
353.2 | 0.015 | Weast and Grasselli, 1989 | BS |
Enthalpy of vaporization
ΔvapH (kJ/mol) | Temperature (K) | Method | Reference | Comment |
---|---|---|---|---|
49.3 | 364. | A | Stephenson and Malanowski, 1987 | Based on data from 340. to 470. K.; AC |

Condensed phase thermochemistry data

Data compiled by: Hussein Y. Afeefy, Joel F. Liebman, and Stephen E. Stein
Quantity | Value | Units | Method | Reference | Comment |
---|---|---|---|---|---|
ΔcH°solid | -707.1 | kcal/mol | Ccb | Verkade, Coops, et al., 1926 | Heat of combustion at 15°C; Corresponding ΔfHºsolid = -198.8 kcal/mol (simple calculation by NIST; no Washburn corrections) |

Reaction thermochemistry data

Data compiled by: Hussein Y. Afeefy, Joel F. Liebman, and Stephen E. Stein
Individual Reactions
By formula: H2 + C6H8O4 = C6H10O4
Quantity | Value | Units | Method | Reference | Comment |
---|---|---|---|---|---|
ΔrH° | -106.8 | kcal/mol | Chyd | Veselova and Sul'man, 1980 | liquid phase |

Kovats' RI, non-polar column, isothermal

View large format table.

Column type Active phase Temperature (C) I Reference Comment
CapillarySE-54140.1029.Grigor'eva, Vasil'ev, et al., 199315. m/0.28 mm/2.4 μm, Ar
CapillarySE-54160.1027.Grigor'eva, Vasil'ev, et al., 199315. m/0.28 mm/2.4 μm, Ar
CapillarySE-54180.1026.Grigor'eva, Vasil'ev, et al., 199315. m/0.28 mm/2.4 μm, Ar
CapillaryUltra-1100.997.Herrmann, Dufka, et al., 198625. m/0.20 mm/0.32 μm, N2
CapillaryUltra-1125.995.Herrmann, Dufka, et al., 198625. m/0.20 mm/0.32 μm, N2
CapillaryUltra-1150.994.Herrmann, Dufka, et al., 198625. m/0.20 mm/0.32 μm, N2
CapillaryUltra-175.999.Herrmann, Dufka, et al., 198625. m/0.20 mm/0.32 μm, N2

Kovats' RI, polar column, isothermal

View large format table.

Column type Active phase Temperature (C) I Reference Comment
CapillaryPEG-40M120.1566.Grigor'eva, Vasil'ev, et al., 199340. m/0.25 mm/0.10 μm, Ar
CapillaryPEG-40M120.1580.Grigor'eva, Vasil'ev, et al., 199340. m/0.25 mm/0.10 μm, Ar

Van Den Dool and Kratz RI, non-polar column, temperature ramp

View large format table.

Column type Active phase I Reference Comment
CapillaryOV-11004.Tan, Holland, et al., 1988He, 8. K/min, 280. C @ 10. min; Column length: 25. m; Column diameter: 0.32 mm; Tstart: 40. C
CapillaryDB-51034.Rostad and Pereira, 198630. m/0.26 mm/0.25 μm, He, 50. C @ 4. min, 6. K/min, 300. C @ 20. min
PackedSE-301000.van den Dool and Kratz, 1963Celite; Tstart: 75. C; Tend: 228. C

Van Den Dool and Kratz RI, non-polar column, custom temperature program

View large format table.

Column type Active phase I Reference Comment
CapillaryVF-5MS1035.5Tret'yakov, 200830. m/0.25 mm/0.25 μm, He; Program: Multi-step temperature program; T(initial)=60C; T(final)=270C

Van Den Dool and Kratz RI, polar column, temperature ramp

View large format table.

Column type Active phase I Reference Comment
CapillaryZB-Wax1595.Ledauphin, Saint-Clair, et al., 200430. m/0.25 mm/0.15 μm, He, 35. C @ 5. min, 5. K/min, 220. C @ 10. min
PackedCarbowax 20M1576.van den Dool and Kratz, 1963Celite 545, 4.6 K/min; Tstart: 75. C; Tend: 228. C

Normal alkane RI, non-polar column, isothermal

View large format table.

Column type Active phase Temperature (C) I Reference Comment
CapillaryOV-101120.1012.Lipp, Krasnykh, et al., 2008Helium; Column length: 50. m; Column diameter: 0.25 mm
CapillaryOV-101130.1014.Lipp, Krasnykh, et al., 2008Helium; Column length: 50. m; Column diameter: 0.25 mm
CapillaryOV-101140.1015.Lipp, Krasnykh, et al., 2008Helium; Column length: 50. m; Column diameter: 0.25 mm
CapillaryOV-101150.1017.Lipp, Krasnykh, et al., 2008Helium; Column length: 50. m; Column diameter: 0.25 mm

Normal alkane RI, non-polar column, temperature ramp

View large format table.

Column type Active phase I Reference Comment
CapillaryUltra-ALLOY-51034.Tsuge, Ohtan, et al., 201130. m/0.25 mm/0.25 μm, 40. C @ 2. min, 20. K/min, 320. C @ 13. min
CapillaryHP-11004.Peters, de Leer, et al., 199425. m/0.2 mm/0.33 μm, He, 50. C @ 5. min, 8. K/min, 300. C @ 10. min
CapillaryUltra-11000.Okumura, 199125. m/0.32 mm/0.25 μm, He, 3. K/min; Tstart: 80. C; Tend: 260. C
CapillaryOV-101996.Pinkston, Spiteller, et al., 1981H2, 80. C @ 7. min, 2. K/min; Column length: 30. m; Column diameter: 0.3 mm; Tend: 275. C
CapillaryOV-101996.Spiteller and Spiteller, 1979He, 75. C @ 7. min, 2. K/min; Column length: 25. m; Tend: 280. C

Normal alkane RI, non-polar column, custom temperature program

View large format table.

Column type Active phase I Reference Comment
CapillaryNonpolar1030.Staples and Zeiger, 2008Program: not specified
CapillaryNonpolar1032.Staples and Zeiger, 2008Program: not specified
CapillaryNonpolar1034.Staples and Zeiger, 2008Program: not specified
CapillaryDB-5 MS1035.Watanabe, Ueda, et al., 200830. m/0.32 mm/1.0 μm, Helium; Program: -10 0C (3 min) 50 0C/min -> 40 0C 5 0C/min -> 290 0C (5 min)
CapillarySE-301002.Vinogradov, 2004Program: not specified
CapillaryHP-11009.Rowland, Blackman, et al., 199525. m/0.25 mm/0.25 μm; Program: 30 0C (4 min) 6 K/min -> 200 0C 15 K/min -> 250 0C (20 min)

Normal alkane RI, polar column, temperature ramp

View large format table.

Column type Active phase I Reference Comment
CapillaryDB-Wax1526.Guo, Wu, et al., 200830. m/0.25 mm/0.25 μm, Helium, 60. C @ 2. min, 10. K/min, 250. C @ 10. min
CapillaryTC-Wax1568.Suhardi, Suzuki, et al., 200260. m/0.25 mm/0.25 μm, He, 40. C @ 10. min, 3. K/min, 230. C @ 10. min

Normal alkane RI, polar column, custom temperature program

View large format table.

Column type Active phase I Reference Comment
CapillaryCarbowax 20M1558.Vinogradov, 2004Program: not specified

Lee's RI, non-polar column, temperature ramp

View large format table.

Column type Active phase I Reference Comment
CapillaryDB-5169.29Rostad and Pereira, 198630. m/0.26 mm/0.25 μm, He, 50. C @ 4. min, 6. K/min, 300. C @ 20. min

References

Verevkin, Kozlova, et al., 2006
Verevkin, Sergey P.; Kozlova, Svetlana A.; Emel'yanenko, Vladimir N.; Nikitin, Eugene D.; Popov, Alexander P.; Krasnykh, Eugen L.,
Vapor Pressures, Enthalpies of Vaporization, and Critical Parameters of a Series of Linear Aliphatic Dimethyl Esters of Dicarboxylic Acids,
J. Chem. Eng. Data, 2006, 51, 5, 1896-1905, https://doi.org/10.1021/je0602418
. [all data]
Katayama, 1992
Katayama, Hirotake,
Measurement and estimation of vapor pressures of dimethyl, diethyl, diisopropyl and dibutyl succinates at reduced pressure.,
J. Chem. Eng. Japan / JCEJ, 1992, 25, 4, 366-372, https://doi.org/10.1252/jcej.25.366
. [all data]
Daubert, Jalowka, et al., 1987
Daubert, T.E.; Jalowka, J.W.; Goren, V.,
AIChE Symp. Ser., 1987, 83, 128. [all data]
Vlasov, Granzhan, et al., 1963
Vlasov, O.N.; Granzhan, V.A.; Savenko, L.M.,
Zh. Prikl. Khim., 1963, 36, 2311. [all data]
Weast and Grasselli, 1989
CRC Handbook of Data on Organic Compounds, 2nd Editon, Weast,R.C and Grasselli, J.G., ed(s)., CRC Press, Inc., Boca Raton, FL, 1989, 1. [all data]
Stephenson and Malanowski, 1987
Stephenson, Richard M.; Malanowski, Stanislaw,
Handbook of the Thermodynamics of Organic Compounds, 1987, https://doi.org/10.1007/978-94-009-3173-2
. [all data]