Benzenamine, 4,4'-methylenebis[N,N-dimethyl-
- Formula: C17H22N2
- Molecular weight: 254.3700
- IUPAC Standard InChIKey: JNRLEMMIVRBKJE-UHFFFAOYSA-N
- CAS Registry Number: 101-61-1
- Chemical structure:
View 3d structure (requires JavaScript / HTML 5) - Other names: Aniline, 4,4'-methylenebis[N,N-dimethyl-; Arnold's base; p,p'-Bis(dimethylamino)diphenylmethane; 4,4'-Bis(dimethylamino)diphenylmethane; Bis[p-(N,N-dimethylamino)phenyl]methane; Bis[p-(dimethylamino)phenyl]methane; Bis[4-(dimethylamino)phenyl]methane; Bis[4-(N,N-dimethylamino)phenyl]methane; 4,4'-Bis(dimethylaminophenyl)methane; 4,4'-Methylenebis[N,N-dimethylaniline]; Michler's base; Michler's hydride; Michler's methane; Reduced michler's ketone; Tetrabase; Tetramethyldiaminodiphenylmethane; N,N,N',N'-Tetramethyl-p,p'-diaminodiphenylmethane; N,N,N',N'-Tetramethyl-4,4'-diaminodiphenylmethane; p,p'-Tetramethyldiaminodiphenylmethane; 4,4'-Tetramethyldiaminodiphenylmethane; p,p-Dimethylaminodiphenylmethane; p,p-Tetramethyldiaminodiphenylmethane; p,p'-Bis(N,N-dimethylaminophenyl)methane; Diphenylmethane, tetramethyldiamino-; Methane, bis(p-(dimethylamino)phenyl)-; Methanediamine, tetramethyl-N,N'-diphenyl-; N,N'-Tetramethyldiaminodiphenylmethane; NCI-C01990; 4,4'-(Dimethylamino)diphenylmethane; BAZE michlerova; 4,4'-Methylenebis(N,N-dimethyl)benzenamine; 4,4'-Methylene bis(N,N'-dimethylaniline); Methane base; Methylene base; p,p'-Tetramethyldiamindiphenylmethane; Methane, bis(4,4'-dimethylaminophenyl)-; NSC 36782; N,N,N',N'-tetramethyl-4,4'-methylenedianiline

Phase change data

Data compiled by: Robert L. Brown and Stephen E. Stein
Quantity | Value | Units | Method | Reference | Comment |
---|---|---|---|---|---|
Tboil | 663. | K | N/A | Buckingham and Donaghy, 1982 |
Reduced pressure boiling point
Tboil (K) | Pressure (bar) | Reference |
---|---|---|
455. to 458. | 0.004 | Buckingham and Donaghy, 1982 |

Gas phase ion energetics data

Data compiled as indicated in comments:
LLK - Sharon G. Lias, Rhoda D. Levin, and Sherif A. Kafafi
RDSH - Henry M. Rosenstock, Keith Draxl, Bruce W. Steiner, and John T. Herron
Ionization energy determinations
IE (eV) | Method | Reference | Comment |
---|---|---|---|
6.72 | PI | Pykhtina, Cherednichenko, et al., 1974 | LLK |
7.1 | CTS | Foster, 1959 | RDSH |

References

Buckingham and Donaghy, 1982
Buckingham, J.; Donaghy, S.M.,
Dictionary of Organic Compounds: Fifth Edition, Chapman and Hall, New York, 1982, 1. [all data]
Pykhtina, Cherednichenko, et al., 1974
Pykhtina, E.V.; Cherednichenko, L.V.; Kardash, I.E.; Evlasheva, T.I.; Sorokin, V.V.; Potapov, V.K.; Pravednikov, A.N.,
Ionization potentials of amines and energies of charge transfer bands in the absorption spectra of complexes of 7,7,8,8-tetracyanoquinodimethan,
High Energy Chem., 1974, 8, 257, In original 307. [all data]
Foster, 1959
Foster, R.,
Ionization potentials of electron donors,
Nature (London), 1959, 183, 1253. [all data]