Dinitrogen pentoxide
- Formula: N2O5
- Molecular weight: 108.0104
- IUPAC Standard InChIKey: ZWWCURLKEXEFQT-UHFFFAOYSA-N
- CAS Registry Number: 10102-03-1
- Chemical structure:
View 3d structure (requires JavaScript / HTML 5) - Other names: dinitrogen pentaoxide

Gas phase thermochemistry data

Quantity | Value | Units | Method | Reference | Comment |
---|---|---|---|---|---|
ΔfH°gas | 11.30 | kJ/mol | Review | Chase, 1998 | Data last reviewed in December, 1964 |
Quantity | Value | Units | Method | Reference | Comment |
S°gas,1 bar | 346.55 | J/mol*K | Review | Chase, 1998 | Data last reviewed in December, 1964 |
Gas Phase Heat Capacity (Shomate Equation)
Cp° = A + B*t + C*t2 + D*t3 +
E/t2
H° − H°298.15= A*t + B*t2/2 +
C*t3/3 + D*t4/4 − E/t + F − H
S° = A*ln(t) + B*t + C*t2/2 + D*t3/3 −
E/(2*t2) + G
Cp = heat capacity (J/mol*K)
H° = standard enthalpy (kJ/mol)
S° = standard entropy (J/mol*K)
t = temperature (K) / 1000.
View plot Requires a JavaScript / HTML 5 canvas capable browser.
Temperature (K) | 298. to 800. | 800. to 6000. |
---|---|---|
A | 23.85152 | 149.4818 |
B | 337.9894 | 0.154807 |
C | -353.4530 | -0.038263 |
D | 134.8407 | 0.003074 |
E | -0.042447 | -8.093070 |
F | -8.123279 | -57.10198 |
G | 288.9203 | 490.8418 |
H | 11.29701 | 11.29701 |
Reference | Chase, 1998 | Chase, 1998 |
Comment | Data last reviewed in December, 1964 | Data last reviewed in December, 1964 |

Reaction thermochemistry data

Data compiled by: Hussein Y. Afeefy, Joel F. Liebman, and Stephen E. Stein
Individual Reactions
By formula: 0.76NO2 + 0.62N2O4 + CH3NO3 = N2O5 + CH3NO2
Quantity | Value | Units | Method | Reference | Comment |
---|---|---|---|---|---|
ΔrH° | 36.24 | kJ/mol | Cm | Ray and Ogg, 1959 | liquid phase |

Gas phase ion energetics data

Data compiled as indicated in comments:
LLK - Sharon G. Lias, Rhoda D. Levin, and Sherif A. Kafafi
LL - Sharon G. Lias and Joel F. Liebman
Ionization energy determinations
IE (eV) | Method | Reference | Comment |
---|---|---|---|
11.4 | PE | Ames and Turner, 1976 | LLK |
12.3 | PE | Ames and Turner, 1976 | Vertical value; LLK |
Appearance energy determinations
Ion | AE (eV) | Other Products | Method | Reference | Comment |
---|---|---|---|---|---|
N+ | 36. ± 2. | ? | EI | O'Connor, Jones, et al., 1996 | LL |
NO+ | 12.95 | NO2+O2 | PI | Jochims, Denzer, et al., 1992 | LL |
NO2+ | 11.8 | NO3 | PI | Jochims, Denzer, et al., 1992 | LL |
NO2+ | ~13. | NO2+O | PI | Jochims, Denzer, et al., 1992 | LL |

Vibrational and/or electronic energy levels

Data compiled by: Marilyn E. Jacox
State: A
Energy (cm-1) |
Med. | Transition | λmin (nm) |
λmax (nm) |
References | ||
---|---|---|---|---|---|---|---|
Td = 23800 | T | gas | Harwood, Jones, et al., 1993 | ||||
Harwood, Burkholder, et al., 1998 | |||||||
State: X
Additional references: Jacox, 1994, page 370; Jacox, 1998, page 331; Jacox, 2003, page 347; McClelland, Hedberg, et al., 1983; Colmont, 1992; Grabow, Andrews, et al., 1996

References

Chase, 1998
Chase, M.W., Jr.,
NIST-JANAF Themochemical Tables, Fourth Edition,
J. Phys. Chem. Ref. Data, Monograph 9, 1998, 1-1951. [all data]
Ray and Ogg, 1959
Ray, J.D.; Ogg, R.A., Jr.,
The heat of formation of methyl nitrate,
J. Phys. Chem., 1959, 63, 1522-1523. [all data]
Ames and Turner, 1976
Ames, D.L.; Turner, D.W.,
Photoelectron spectroscopic studies of dinitrogen tetroxide and dinitrogen pentoxide,
Proc. R. Soc. London A:, 1976, 348, 175. [all data]
O'Connor, Jones, et al., 1996
O'Connor, C.S.S.; Jones, N.C.; O'Neale, K.; Price, S.D.,
Electron-impact ionization of dinitrogen pentoxide,
Int. J. Mass Spectrom. Ion Processes, 1996, 154, 203. [all data]
Jochims, Denzer, et al., 1992
Jochims, H.-W.; Denzer, W.; Baumgartel, H.; Losking, O.; Willner, H.,
Photochemical decay reactions of N2O5, HNO3, ClNO3 and BrNO3 in the energy range 10-20 eV,
Ber. Bunsen-Ges. Phys. Chem., 1992, 96, 573. [all data]
Harwood, Jones, et al., 1993
Harwood, M.H.; Jones, R.L.; Cox, R.A.; Lutman, E.; Rattigan, O.V.,
Temperature-dependent absorption cross-sections of N2O5,
J. Photochem. Photobiol. A: Chem., 1993, 73, 3, 167, https://doi.org/10.1016/1010-6030(93)90001-2
. [all data]
Harwood, Burkholder, et al., 1998
Harwood, M.H.; Burkholder, J.B.; Ravishankara, A.R.,
Photodissociation of BrONO,
J. Phys. Chem. A, 1998, 102, 8, 1309, https://doi.org/10.1021/jp9729829
. [all data]
Fateley, Bent, et al., 1959
Fateley, W.G.; Bent, H.A.; Crawford, B., Jr.,
Infrared Spectra of the Frozen Oxides of Nitrogen,
J. Chem. Phys., 1959, 31, 1, 204, https://doi.org/10.1063/1.1730296
. [all data]
Hisatsune, Devlin, et al., 1962
Hisatsune, I.C.; Devlin, J.P.; Wada, Y.,
Spectrochim. Acta, 1962, 18, 1641. [all data]
Lovejoy, Chackerian, et al., 1980
Lovejoy, R.W.; Chackerian, C., Jr.; Boese, R.W.,
Integrated band intensities of gaseous N_2O_5,
Appl. Opt., 1980, 19, 5, 744, https://doi.org/10.1364/AO.19.000744
. [all data]
Cantrell, Davidson, et al., 1988
Cantrell, C.A.; Davidson, J.A.; McDaniel, A.H.; Shetter, R.E.; Calvert, J.G.,
Infrared absorption cross sections for N2O5,
Chem. Phys. Lett., 1988, 148, 4, 358, https://doi.org/10.1016/0009-2614(88)87288-9
. [all data]
Bencivenni, Sanna, et al., 1996
Bencivenni, L.; Sanna, N.; Schriver-Mazzuoli, L.; Schriver, A.,
Infrared spectrum and theoretical study of the dinitrogen pentoxide molecule (N2O5) in solid argon,
J. Chem. Phys., 1996, 104, 20, 7836, https://doi.org/10.1063/1.471500
. [all data]
Varetti and Pimentel, 1971
Varetti, E.L.; Pimentel, G.C.,
Isomeric Forms of Dinitrogen Trioxide in a Nitrogen Matrix,
J. Chem. Phys., 1971, 55, 8, 3813, https://doi.org/10.1063/1.1676666
. [all data]
Smith and Guillory, 1977
Smith, G.R.; Guillory, W.A.,
Spectroscopy of the thermal oxidation of NO in solid oxygen at cryogenic temperatures,
J. Mol. Spectrosc., 1977, 68, 2, 223, https://doi.org/10.1016/0022-2852(77)90438-6
. [all data]
Bandow, Akimoto, et al., 1984
Bandow, H.; Akimoto, H.; Akiyama, S.; Tezuka, T.,
Photolysis of asym-N2O4 (ONONO2) isolated in an argon matrix at 11 K,
Chem. Phys. Lett., 1984, 111, 4-5, 496, https://doi.org/10.1016/0009-2614(84)85547-5
. [all data]
Domenech, Fraser, et al., 1997
Domenech, J.L.; Fraser, G.T.; Hight Walker, A.R.; Lafferty, W.J.; Suenram, R.D.,
Infrared and Microwave Molecular-Beam Studies of N2O5,
J. Mol. Spectrosc., 1997, 184, 1, 172, https://doi.org/10.1006/jmsp.1997.7323
. [all data]
De Lucia, Winnewisser, et al., 1989
De Lucia, F.C.; Winnewisser, B.P.; Winnewisser, M.; Pawelke, G.,
The far-infrared spectrum of N2O5 in the gas phase,
J. Mol. Spectrosc., 1989, 136, 1, 151, https://doi.org/10.1016/0022-2852(89)90227-0
. [all data]
Jacox, 1994
Jacox, M.E.,
Vibrational and electronic energy levels of polyatomic transient molecules, American Chemical Society, Washington, DC, 1994, 464. [all data]
Jacox, 1998
Jacox, M.E.,
Vibrational and electronic energy levels of polyatomic transient molecules: supplement A,
J. Phys. Chem. Ref. Data, 1998, 27, 2, 115-393, https://doi.org/10.1063/1.556017
. [all data]
Jacox, 2003
Jacox, M.E.,
Vibrational and electronic energy levels of polyatomic transient molecules: supplement B,
J. Phys. Chem. Ref. Data, 2003, 32, 1, 1-441, https://doi.org/10.1063/1.1497629
. [all data]
McClelland, Hedberg, et al., 1983
McClelland, B.W.; Hedberg, L.; Hedberg, K.; Hagen, K.,
Molecular structure of dinitrogen pentoxide in the gas phase. Large amplitude motion in a system of coupled rotors,
J. Am. Chem. Soc., 1983, 105, 12, 3789, https://doi.org/10.1021/ja00350a006
. [all data]
Colmont, 1992
Colmont, J.-M.,
Microwave spectrum of dinitrogen pentoxide,
J. Mol. Spectrosc., 1992, 155, 1, 11, https://doi.org/10.1016/0022-2852(92)90544-X
. [all data]
Grabow, Andrews, et al., 1996
Grabow, J.-U.; Andrews, A.M.; Fraser, G.T.; Irikura, K.K.; Suenram, R.D.; Lovas, F.J.; Lafferty, W.J.; Domenech, J.L.,
Microwave spectrum, large-amplitude motions, and ab initio calculations for N2O5,
J. Chem. Phys., 1996, 105, 17, 7249, https://doi.org/10.1063/1.472586
. [all data]