Urea, N-methyl-N'-phenyl-
- Formula: C8H10N2O
- Molecular weight: 150.1778
- IUPAC Standard InChIKey: SQBHGDSDVWCPHN-UHFFFAOYSA-N
- CAS Registry Number: 1007-36-9
- Chemical structure:
View 3d structure (requires JavaScript / HTML 5) - Other names: Urea, 1-methyl-3-phenyl-; Defenuron; N-Methyl-N'-phenylurea; N-Phenyl-N'-methylurea; 1-Methyl-3-phenylurea

Gas phase ion energetics data

Data compiled by: Sharon G. Lias, Rhoda D. Levin, and Sherif A. Kafafi
Ionization energy determinations
IE (eV) | Method | Reference |
---|---|---|
8.50 ± 0.05 | EI | Baldwin, Loudon, et al., 1976 |

References

Baldwin, Loudon, et al., 1976
Baldwin, M.A.; Loudon, A.G.; Maccoll, A.; Webb, K.S.,
The nature and fragmentation pathways of the molecular ions of some arylureas, arylthioureas, acetanilides, thioacetanilides and related compounds,
Org. Mass Spectrom., 1976, 11, 1181. [all data]