Acetic acid, (4-chlorophenoxy)-, decyl ester
- Formula: C18H27ClO3
- Molecular weight: 326.858
- IUPAC Standard InChIKey: IYEKAGHJDDMHEC-UHFFFAOYSA-N
- Chemical structure:

Van Den Dool and Kratz RI, non-polar column, temperature ramp

Column type | Active phase | I | Reference | Comment |
---|---|---|---|---|
Capillary | 5 % Phenyl methyl siloxane | 2899. | Zaikin, 2014 | 30. m/0.25 mm/0.25 μm, 15. K/min, 270. C @ 15. min; Tstart: 60. C |

References

Zaikin, 2014
Zaikin, V.G.,
Personal communication: Retention indices measured during 2014, 2014. [all data]