Glutaric acid, 2,2,3,3,4,4,5,5-octafluoropentyl 3-hexyl ester
- Formula: C16H22F8O4
- Molecular weight: 430.3307
- IUPAC Standard InChIKey: GTLQZPRDWKGRAU-UHFFFAOYSA-N
- Chemical structure:

Van Den Dool and Kratz RI, non-polar column, temperature ramp

Column type | Active phase | I | Reference | Comment |
---|---|---|---|---|
Capillary | 5 % Phenyl methyl siloxane | 1624. | Zaikin, 2012 | 30. m/0.25 mm/0.25 μm, 15. K/min, 270. C @ 15. min; Tstart: 60. C |

References

Zaikin, 2012
Zaikin, V.G.,
Personal communication: Retention indices measured during 2012, 2012. [all data]