Glutaric acid, 2,3-dichlorophenyl 2,3,5-trichlorophenyl ester
- Formula: C17H11Cl5O4
- Molecular weight: 456.532
- IUPAC Standard InChIKey: WMVZVHVCDHYKRK-UHFFFAOYSA-N
- Chemical structure:

Van Den Dool and Kratz RI, non-polar column, temperature ramp

Column type | Active phase | I | Reference | Comment |
---|---|---|---|---|
Capillary | 5 % Phenyl methyl siloxane | 3220. | Zaikin, 2012 | 30. m/0.25 mm/0.25 μm, 15. K/min, 270. C @ 15. min; Tstart: 60. C |

References

Zaikin, 2012
Zaikin, V.G.,
Personal communication: Retention indices measured during 2012, 2012. [all data]