Phthalic acid, 2-(4-bromophenoxy)ethyl decyl ester
- Formula: C26H33BrO5
- Molecular weight: 505.441
- IUPAC Standard InChIKey: HEZHFQSXHGLOLG-UHFFFAOYSA-N
- Chemical structure:

Van Den Dool and Kratz RI, non-polar column, temperature ramp

Column type | Active phase | I | Reference | Comment |
---|---|---|---|---|
Capillary | 5 % Phenyl methyl siloxane | 3434. | Zaikin, 2011 | 30. m/0.25 mm/0.25 μm, 15. K/min, 270. C @ 15. min; Tstart: 60. C |

References

Zaikin, 2011
Zaikin, V.G.,
Personal communication: Retention indices measured during 2011, 2011. [all data]