Diglycolic acid, hexyl 2-methylpentyl ester
- Formula: C16H30O5
- Molecular weight: 302.4064
- IUPAC Standard InChIKey: TWJQITKSUHNDTB-UHFFFAOYSA-N
- Chemical structure:

Van Den Dool and Kratz RI, non-polar column, temperature ramp

Column type | Active phase | I | Reference | Comment |
---|---|---|---|---|
Capillary | 5 % Phenyl methyl siloxane | 2492. | Zaikin, 2011 | 30. m/0.25 mm/0.25 μm, 15. K/min, 270. C @ 15. min; Tstart: 60. C |

References

Zaikin, 2011
Zaikin, V.G.,
Personal communication: Retention indices measured during 2011, 2011. [all data]