Succinic acid, heptadecyl 2,4,4-trimethylpentyl ester
- Formula: C29H56O4
- Molecular weight: 468.7525
- IUPAC Standard InChIKey: MMTNKRXQHJUQSY-UHFFFAOYSA-N
- Chemical structure:

Van Den Dool and Kratz RI, non-polar column, temperature ramp

Column type | Active phase | I | Reference | Comment |
---|---|---|---|---|
Capillary | 5 % Phenyl methyl siloxane | 3114. | Zaikin, 2011 | 30. m/0.25 mm/0.25 μm, 15. K/min, 270. C @ 15. min; Tstart: 60. C |

References

Zaikin, 2011
Zaikin, V.G.,
Personal communication: Retention indices measured during 2011, 2011. [all data]