Sebacic acid, butyl 4-chloro-2-methylbenzyl ester
- Formula: C22H33ClO4
- Molecular weight: 396.948
- IUPAC Standard InChIKey: CDYRTFRUNIRZGU-UHFFFAOYSA-N
- Chemical structure:

Van Den Dool and Kratz RI, non-polar column, temperature ramp

Column type | Active phase | I | Reference | Comment |
---|---|---|---|---|
Capillary | 5 % Phenyl methyl siloxane | 2870. | Zaikin, 2011 | 30. m/0.25 mm/0.25 μm, 15. K/min, 270. C @ 15. min; Tstart: 60. C |

References

Zaikin, 2011
Zaikin, V.G.,
Personal communication: Retention indices measured during 2011, 2011. [all data]