1-(3-chlorophenyl)piperazine, acetyl

Kovats' RI, non-polar column, temperature ramp

View large format table.

Column type Active phase I Reference Comment
CapillaryHP-12265.Bickeboeller-Friedrich and Maurer, 200112. m/0.2 mm/0.33 μm, He, 100. C @ 3. min, 30. K/min, 310. C @ 8. min
CapillaryHP-12265.Bickeboeller-Friedrich and Maurer, 200112. m/0.2 mm/0.33 μm, He, 100. C @ 3. min, 30. K/min, 310. C @ 8. min

References

Bickeboeller-Friedrich and Maurer, 2001
Bickeboeller-Friedrich, J.; Maurer, H.H., Screening for detection of new antidepressants, neuroleptics, hypnotics, and their metabolites in urine by GC-MS developed using rat liver microsomes, Ther. Drug Monit., 2001, 23, 1, 61-70, https://doi.org/10.1097/00007691-200102000-00012 . [all data]