Glutaric acid, 2,6-difluoro-4-bromobenzyl ethyl ester
- Formula: C14H15BrF2O4
- Molecular weight: 365.167
- IUPAC Standard InChIKey: ADXMZGHFVFVKNJ-UHFFFAOYSA-N
- Chemical structure:

Van Den Dool and Kratz RI, non-polar column, temperature ramp

Column type | Active phase | I | Reference | Comment |
---|---|---|---|---|
Capillary | 5 % Phenyl methyl siloxane | 2084. | Zaikin, 2010 | 30. m/0.25 mm/0.25 μm, 15. K/min, 270. C @ 15. min; Tstart: 60. C |

References

Zaikin, 2010
Zaikin, V.G.,
Personal communication: Retention indices measured during 2010, 2010. [all data]