[4-(4-Trifluoroacetoxy-5-tert-butyl-2-methylphenyl)sulfanyl-2-tert-butyl-5-methylphenyl] trifluoroacetate

Van Den Dool and Kratz RI, non-polar column, temperature ramp

View large format table.

Column type Active phase I Reference Comment
CapillaryVF-5MS2217.N/A30. m/0.25 mm/0.25 μm, He; Tstart: 60. C; Tend: 270. C

References

No reference data available.