O,O'-Bis(tert-butyldimethylsilyl) ,2-trimethylsilylamino-9-(2-hydroxyethoxymethyl)-purin-6-ol ether
- Formula: C17H35N5O3Si3
- Molecular weight: 441.7480
- IUPAC Standard InChIKey: CIIRNLKDVGGHFV-UHFFFAOYSA-N
- Chemical structure:

Van Den Dool and Kratz RI, non-polar column, temperature ramp

Column type | Active phase | I | Reference | Comment |
---|---|---|---|---|
Capillary | VF-5MS | 2442. | N/A | 30. m/0.25 mm/0.25 μm, He; Tstart: 60. C; Tend: 270. C |

References

No reference data available.