Silane, chlorodiethyl(2,7-dimethyloct-1-en-3-yn-5-yloxy)-
- Formula: C14H25ClOSi
- Molecular weight: 272.886
- IUPAC Standard InChIKey: XHSAWSZFZLNXGX-UHFFFAOYSA-N
- Chemical structure:

Van Den Dool and Kratz RI, non-polar column, temperature ramp

Column type | Active phase | I | Reference | Comment |
---|---|---|---|---|
Capillary | 5 % Phenyl methyl siloxane | 1461. | Zaikin, 2009 | 30. m/0.25 mm/0.25 μm, 15. K/min, 270. C @ 15. min; Tstart: 60. C |

References

Zaikin, 2009
Zaikin, V.G.,
Personal Communication: Retention indices measured during the period 2008 to 2009, 2009. [all data]