1,1-Dichloro-2,2-di(2-chloroethenyl)diarsine

Normal alkane RI, non-polar column, temperature ramp

View large format table.

Column type Active phase I Reference Comment
CapillaryDB-51729.Hanaoka, Nomura, et al., 200630. m/0.32 mm/0.25 μm, He, 100. C @ 5. min, 10. K/min; Tend: 280. C

References

Hanaoka, Nomura, et al., 2006
Hanaoka, S.; Nomura, K.; Wada, T., Determination of mustard and lewisite related compounds in abandoned chemical weapons (Yellow shells) from sources in China and Japan, J. Chromatogr. A, 2006, 1101, 1-2, 268-277, https://doi.org/10.1016/j.chroma.2005.10.028 . [all data]