4,6-Di-O-acetyl-1,5-anhydro-2,3-di-O-methyl-D-mannitol

Van Den Dool and Kratz RI, non-polar column, temperature ramp

View large format table.

Column type Active phase I Reference Comment
CapillaryDB-51752.77Elvebak, Cha, et al., 199530. m/0.25 mm/0.25 μm, He, 2. K/min; Tstart: 80. C; Tend: 250. C

References

Elvebak, Cha, et al., 1995
Elvebak, L.E., II; Cha, H.J.; McNally, P.; Gray, G.R., Authentic standards for the reductive-cleavage method. The positional isomers of partially methylated and acetylated or benzoylated 1,5-anhydro-D-mannitol, Carbohyd. Res., 1995, 274, 71-83, https://doi.org/10.1016/0008-6215(95)00082-5 . [all data]