Sebacic acid, 2,6-dichlorophenyl propyl ester
- Formula: C19H26Cl2O4
- Molecular weight: 389.313
- IUPAC Standard InChIKey: HZZSERJVAAQNOD-UHFFFAOYSA-N
- Chemical structure:

Van Den Dool and Kratz RI, non-polar column, temperature ramp

Column type | Active phase | I | Reference | Comment |
---|---|---|---|---|
Capillary | 5 % Phenyl methyl siloxane | 2768. | Zaikin, 2009 | 30. m/0.25 mm/0.25 μm, 15. K/min, 270. C @ 15. min; Tstart: 60. C |

References

Zaikin, 2009
Zaikin, V.G.,
Personal Communication: Retention indices measured during the period 2008 to 2009, 2009. [all data]