1,2-Cyclohexanedicarboxylic acid, cyclobutyl hexyl ester
- Formula: C18H30O4
- Molecular weight: 310.4284
- IUPAC Standard InChIKey: ZEJUBRIRNHIJNG-UHFFFAOYSA-N
- Chemical structure:

Van Den Dool and Kratz RI, non-polar column, custom temperature program

Column type | Active phase | I | Reference | Comment |
---|---|---|---|---|
Capillary | 5 % Phenyl methyl siloxane | 2257. | Zaikin, 2007 | Column length: 30. m; Column diameter: 0.19 mm; Program: 20C => 5C/min => 120C => 10C/min => 280C |

References

Zaikin, 2007
Zaikin, V.G.,
Personal Communication: Retention indices measured during the period 2006 to 2007 (I), 2007. [all data]