5-Fluoro-2-trifluoromethylbenzoic acid, isohexyl ester
- Formula: C14H16F4O2
- Molecular weight: 292.2693
- IUPAC Standard InChIKey: SYJGXWAKRPLOTO-UHFFFAOYSA-N
- Chemical structure:

Van Den Dool and Kratz RI, non-polar column, custom temperature program

Column type | Active phase | I | Reference | Comment |
---|---|---|---|---|
Capillary | 5 % Phenyl methyl siloxane | 1471. | Zaikin, 2007 | Column length: 30. m; Column diameter: 0.19 mm; Program: 20C => 5C/min => 120C => 10C/min => 280C |

References

Zaikin, 2007
Zaikin, V.G.,
Personal Communication: Retention indices measured during the period 2006 to 2007 (I), 2007. [all data]