Geraniol, TMS derivative
- Formula: C13H26OSi
- Molecular weight: 226.4304
- IUPAC Standard InChIKey: WJOVQJSWBJCMJE-JLHYYAGUSA-N
- Chemical structure:
- Other names: Geraniol, trimethylsilyl ether; Pyrrol[(2E)-3,7-dimethylocta-2,6-dien-1-yl]oxymorpho(trimethyl)silane

Van Den Dool and Kratz RI, non-polar column, custom temperature program

Column type | Active phase | I | Reference | Comment |
---|---|---|---|---|
Capillary | VF-5MS | 1359.2 | Tret'yakov, 2007 | 30. m/0.25 mm/0.25 μm, He; Program: Multi-step temperature program; T(initial)=60C; T(final)=270C |

References

Tret'yakov, 2007
Tret'yakov, K.V.,
Retention Data. NIST Mass Spectrometry Data Center., NIST Mass Spectrometry Data Center, 2007. [all data]