Terephthalic acid, heptyl pentyl ester

Kovats' RI, non-polar column, isothermal

Data compiled by: NIST Mass Spectrometry Data Center, William E. Wallace, director

Column type Capillary
Active phase SE-30
Column length (m) 50.
Carrier gas He
Substrate
Column diameter (mm) 0.3
Phase thickness (μm) 0.39
Temperature (C) 250.
I 2466.
ReferenceFriocourt, Berthou, et al., 1979
Comment MSDC-RI

References

Friocourt, Berthou, et al., 1979
Friocourt, M.P.; Berthou, F.; Picart, D.; Dreano, Y.; Floch, H.H., Glass Capillary Column Gas Chromatography of Phthalate Esters, J. Chromatogr., 1979, 172, 1, 261-271, https://doi.org/10.1016/S0021-9673(00)90961-0 . [all data]