Sarcosine, n-heptafluorobutyryl-, decyl ester
- Formula: C17H26F7NO3
- Molecular weight: 425.3821
- IUPAC Standard InChIKey: UYHZRSOKCZWCQL-UHFFFAOYSA-N
- Chemical structure:
View 3d structure (requires JavaScript / HTML 5) - Permanent link for this species. Use this link for bookmarking this species for future reference.

Van Den Dool and Kratz RI, non-polar column, custom temperature program

Column type | Active phase | I | Reference | Comment |
---|---|---|---|---|
Capillary | 5 % Phenyl methyl siloxane | 1863. | Zaikin, 2005 | Column length: 30. m; Column diameter: 0.19 mm; Program: 20C => 5C/min => 120C => 10C/min => 280C |

References

Zaikin, 2005
Zaikin, V.G.,
Personal Communication: Retention indices measured during the period 2004 to 2005, 2005. [all data]