Acetamide, N-(1-naphthyl)-2-bromo-
- Formula: C12H10BrNO
- Molecular weight: 264.118
- IUPAC Standard InChIKey: YTXQWCWHEKIEDH-UHFFFAOYSA-N
- Chemical structure:
View 3d structure (requires JavaScript / HTML 5) - Permanent link for this species. Use this link for bookmarking this species for future reference.

Van Den Dool and Kratz RI, non-polar column, custom temperature program

Column type | Active phase | I | Reference | Comment |
---|---|---|---|---|
Capillary | 5 % Phenyl methyl siloxane | 2068. | Zaikin, 2003 | Column length: 30. m; Column diameter: 0.19 mm; Program: 50 C to 120 C at 5 C/min; 120 C to 290 C at 12 C/min |

References

Zaikin, 2003
Zaikin, V.G.,
Personal Communication: Retention indices measured during the period 2001 to 2003, 2003. [all data]