2-Furancarboxamide, N-tetrahydrofurfuryl-

Van Den Dool and Kratz RI, non-polar column, custom temperature program

View large format table.

Column type Active phase I Reference Comment
Capillary5 % Phenyl methyl siloxane1637.Zaikin, 2003Column length: 30. m; Column diameter: 0.19 mm; Program: 50 C to 120 C at 5 C/min; 120 C to 290 C at 12 C/min

References

Zaikin, 2003
Zaikin, V.G., Personal Communication: Retention indices measured during the period 2001 to 2003, 2003. [all data]