3-Trifluoromethylbenzoic acid, 2-methyloct-5-yn-4-yl ester

Van Den Dool and Kratz RI, non-polar column, custom temperature program

Data compiled by: NIST Mass Spectrometry Data Center, William E. Wallace, director

Column type Capillary
Active phase 5 % Phenyl methyl siloxane
Column length (m) 30.
Carrier gas
Substrate
Column diameter (mm) 0.19
Phase thickness (μm)
Program 50 C to 120 C at 5 C/min; 120 C to 290 C at 12 C/min
I 1651.
ReferenceZaikin, 2003
Comment MSDC-RI

References

Zaikin, 2003
Zaikin, V.G., Personal Communication: Retention indices measured during the period 2001 to 2003, 2003. [all data]