2E,4Z-Hexadiene, adduct with 4-methyl-1,2,4-triazolin-3,5-dione
- Formula: C9H13N3O2
- Molecular weight: 195.2184
- IUPAC Standard InChIKey: MJBCSCMWBFGHCJ-RNFRBKRXSA-N
- Chemical structure:
View 3d structure (requires JavaScript / HTML 5) - Stereoisomers:
- Other names: 2E,4Z-Hexadiene + MTAD adduct

Normal alkane RI, non-polar column, temperature ramp

Column type | Active phase | I | Reference | Comment |
---|---|---|---|---|
Capillary | SE-52 | 1580. | Young, Vouros, et al., 1990 | 100. C @ 2. min, 15. K/min; Column length: 60. m; Tend: 280. C |

References

Young, Vouros, et al., 1990
Young, D.C.; Vouros, P.; Holick, M.F.,
Gas chromatography-mass spectrometry of conjugated dienes by derivatization with 4-methyl-1,2,4-triazoline-3,5-dione,
J. Chromatogr., 1990, 522, 295-302, https://doi.org/10.1016/0021-9673(90)85199-6
. [all data]