5-Androstene, 4,4-dimethyl-

Van Den Dool and Kratz RI, non-polar column, temperature ramp

View large format table.

Column type Active phase I Reference Comment
CapillarySE-542219.35Yin, Xiu, et al., 200135. C @ 3. min, 4. K/min, 230. C @ 10. min; Column length: 25. m; Column diameter: 0.31 mm

References

Yin, Xiu, et al., 2001
Yin, W.; Xiu, Z.; Aijin, H., Analysis of the volatile components in trogopterorum feces by capillary gas chromatography and gas chromatography/mass spectrometry, Fenxi Huaxue, 2001, 29, 2, 195-198. [all data]