2,6-Dimethyl-3,5,7-octatriene-2-ol, ,E,E-

Normal alkane RI, polar column, temperature ramp

Data compiled by: NIST Mass Spectrometry Data Center, William E. Wallace, director

Column type CapillaryCapillary
Active phase HP-Innowax FSCHP-Innowax FSC
Column length (m) 60.60.
Carrier gas HeHe
Substrate
Column diameter (mm) 0.250.25
Phase thickness (μm) 0.25
Tstart (C) 60.60.
Tend (C) 220.240.
Heat rate (K/min) 4.4.
Initial hold (min) 10.10.
Final hold (min) 10.10.
I 1830.1830.
ReferenceTümen, Baser, et al., 1998Baser, Kirimer, et al., 1997
Comment MSDC-RI MSDC-RI

Normal alkane RI, non-polar column, custom temperature program

Data compiled by: NIST Mass Spectrometry Data Center, William E. Wallace, director

Column type Capillary
Active phase DB-1
Column length (m) 60.
Carrier gas Helium
Substrate
Column diameter (mm) 0.25
Phase thickness (μm) 0.25
Program 50 0C (5 min) 3 0C/min -> 120 0C 5 0C/min -> 250 0C (3 min) 15 0C/min -> 300 0C (20 min)
I 1187.
ReferenceDelort and Jaquier, 2009
Comment MSDC-RI

References

Tümen, Baser, et al., 1998
Tümen, G.; Baser, K.H.C.; Demirci, B.; Ermin, N., The essential oils of Satureja coerulea Janka and Thymus aznavourii Velen., Flavour Fragr. J., 1998, 13, 1, 65-67, https://doi.org/10.1002/(SICI)1099-1026(199801/02)13:1<65::AID-FFJ695>3.0.CO;2-Q . [all data]

Baser, Kirimer, et al., 1997
Baser, K.H.C.; Kirimer, N.; Duman, H., Composition of the essential oil of Micromeria dolichodontha P. H. Davis, Flavour Fragr. J., 1997, 12, 4, 289-291, https://doi.org/10.1002/(SICI)1099-1026(199707)12:4<289::AID-FFJ640>3.0.CO;2-A . [all data]