Tetrahydrocannabinol, TFA

Kovats' RI, non-polar column, isothermal

Data compiled by: NIST Mass Spectrometry Data Center, William E. Wallace, director

Column type Packed
Active phase OV-1
Column length (m) 2.
Carrier gas
Substrate Chromosorb W (60-80 mesh)
Column diameter (mm)
Phase thickness (μm)
Temperature (C) 260.
I 2400.
ReferenceHoffman and Yang, 1972
Comment MSDC-RI

References

Hoffman and Yang, 1972
Hoffman, N.E.; Yang, R.K., Gas Chromatography of Δ1-Tetrahydrocannabinol, Anal. Letters, 1972, 5, 1, 7-11, https://doi.org/10.1080/00032717208066082 . [all data]