1-Butene, 2(4)-phenyl-4(2)-trimethylsilyl

Kovats' RI, non-polar column, isothermal

View large format table.

Column type Active phase Temperature (C) I Reference Comment
CapillaryOV-101120.1360.Blazsó and Garzó, 1974Column length: 20. m
CapillaryOV-10160.1340.Blazsó and Garzó, 1974Column length: 20. m

References

Blazsó and Garzó, 1974
Blazsó, M.; Garzó, G., Identification of Isomeric Structures of Phenyl and Trimethylsilyl Substituted 1-Alkenes by Gas Chromatography, Chromatographia, 1974, 7, 8, 395-398, https://doi.org/10.1007/BF02330942 . [all data]