Pentanoic acid, 4-methyl, butyl ester

Kovats' RI, non-polar column, isothermal

Data compiled by: NIST Mass Spectrometry Data Center, William E. Wallace, director

Column type CapillaryPackedPacked
Active phase OV-101SE-30SE-30
Column length (m) 15.3.73.7
Carrier gas
Substrate  Celaton (62-72 mesh)Celite 560
Column diameter (mm) 0.22
Phase thickness (μm)
Temperature (C) 80.150.150.
I 1139.1125.1138.
ReferenceKomárek, Hornová, et al., 1983Ashes and Haken, 1974Germaine and Haken, 1969
Comment MSDC-RI MSDC-RI MSDC-RI

References

Komárek, Hornová, et al., 1983
Komárek, K.; Hornová, L.; Horna, A.; Churácek, J., Glass capillary gas chromatography of homologous series of esters. IV. Separation of homologous series of certain halogenopropyl esters of aliphatic carboxylic acids on OV-101, J. Chromatogr., 1983, 281, 299-303, https://doi.org/10.1016/S0021-9673(01)87889-4 . [all data]

Ashes and Haken, 1974
Ashes, J.R.; Haken, J.K., Gas chromatography of homologous esters. VI. Structure-retention increments of aliphatic esters, J. Chromatogr., 1974, 101, 1, 103-123, https://doi.org/10.1016/S0021-9673(01)94737-5 . [all data]

Germaine and Haken, 1969
Germaine, R.W.; Haken, J.K., Gas chromatography of homologous esters. Part 1. Simple aliphatic esters, J. Chromatogr., 1969, 43, 33-42, https://doi.org/10.1016/S0021-9673(00)99162-3 . [all data]