E-4-tetradecenyl acetate
- Formula: C16H30O2
- Molecular weight: 254.4082
- IUPAC Standard InChIKey: CCPJDPZZVYXVBH-VAWYXSNFSA-N
- Chemical structure:
View 3d structure (requires JavaScript / HTML 5) - Stereoisomers:

Van Den Dool and Kratz RI, non-polar column, temperature ramp

Column type | Active phase | I | Reference | Comment |
---|---|---|---|---|
Capillary | DB-5 | 1796. | Marques, McElfresh, et al., 2000 | 30. m/0.25 mm/0.25 μm, 100. C @ 1. min, 5. K/min, 275. C @ 3. min |

Van Den Dool and Kratz RI, polar column, temperature ramp

Column type | Active phase | I | Reference | Comment |
---|---|---|---|---|
Capillary | DB-Wax | 2104. | Marques, McElfresh, et al., 2000 | 30. m/0.32 mm/0.25 μm, 100. C @ 1. min, 5. K/min; Tend: 240. C |

References

Marques, McElfresh, et al., 2000
Marques, F.A.; McElfresh, J.S.; Millar, J.G.,
Kováts retention indexes of monounsaturated C12, C14, and C16 alcohols, acetates and aldehydes commonly found in lepidopteran pheromone blends,
J. Braz. Chem. Soc., 2000, 11, 6, 592-599, https://doi.org/10.1590/S0103-50532000000600007
. [all data]