GA58 methyl ester TMS ether

Van Den Dool and Kratz RI, non-polar column, custom temperature program

View large format table.

Column type Active phase I Reference Comment
CapillaryDB-12742.Pearce, Koshioka, et al., 199415. m/0.22 mm/0.25 μm; Program: 60(0.1 min)-200 0C at 20 deg/min; 200-300 0C at 5 deg/min
CapillaryOV-12740.Kobayashi, Gaskin, et al., 199325. m/0.2 mm/0.25 μm; Program: 50C(2min) => 10C/min => 150C => 3C/min => 300C

Normal alkane RI, non-polar column, custom temperature program

View large format table.

Column type Active phase I Reference Comment
CapillaryDB-12744.Lange, Hedden, et al., 199325. m/0.32 mm/0.33 μm, He; Program: 50C(1min) => 20C/min => 240C => 4C/min => 295C
CapillaryBP-12752.Lange, Hedden, et al., 1993, 225. m/0.25 mm/0.33 μm, He; Program: 60C(1min) => 20C/min => 240C => 4C/min => 300C

References

Pearce, Koshioka, et al., 1994
Pearce, D.W.; Koshioka, M.; Pharis, R.P., Chromatography of gibberellins, J. Chromatogr. A, 1994, 658, 1, 91-122, https://doi.org/10.1016/0021-9673(94)85210-3 . [all data]

Kobayashi, Gaskin, et al., 1993
Kobayashi, M.; Gaskin, P.; Spray, C.R.; Suzuki, Y.; Phinney, B.O.; MacMillan, J., Metabolism and biological activity of Gibberellin A4 in vegetative shoots of Zea mays, Oryza sativa, and Arabidopsis thaliana, Plant Physiol., 1993, 102, 379-386. [all data]

Lange, Hedden, et al., 1993
Lange, T.; Hedden, P.; Graebe, J.E., Biosynthesis of 12α- and 13-hydroxylated gibberellins in a cell-free system from Cucurbita maxima endosperm and the identification of new endogenous gibberellins, Planta, 1993, 189, 3, 340-349, https://doi.org/10.1007/BF00194430 . [all data]

Lange, Hedden, et al., 1993, 2
Lange, T.; Hedden, P.; Graebe, J.E., Gibberellin biosynthesis in cell-free extracts from developing Cucurbita maxima embryos and the identification of new endogenous gibberellins, Planta, 1993, 189, 3, 350-358, https://doi.org/10.1007/BF00194431 . [all data]