GA19, MeTMS

Normal alkane RI, non-polar column, temperature ramp

Data compiled by: NIST Mass Spectrometry Data Center, William E. Wallace, director

Column type CapillaryCapillaryCapillary
Active phase DB-1DB-1Polydimethyl siloxane
Column length (m) 15.15.
Carrier gas
Substrate
Column diameter (mm) 0.2580.258
Phase thickness (μm)
Tstart (C) 160.160.200.
Tend (C) 280.280.320.
Heat rate (K/min) 16.16.5.
Initial hold (min) 2.2.2.
Final hold (min)
I 2589.2583.2589.
ReferenceOyama, Yamauchi, et al., 1996Oyama, Yamauchi, et al., 1996, 2Fujioka, Yamane, et al., 1988
Comment MSDC-RI MSDC-RI MSDC-RI

Kovats' RI, non-polar column, custom temperature program

View large format table.

Column type Active phase I Reference Comment
CapillaryHP-52612.Morvan-Bertrand, Ernstsen, et al., 2001Program: not specified
CapillaryHP-52615.Morvan-Bertrand, Ernstsen, et al., 2001Program: not specified
CapillaryDB-12588.Koshioka, Miyamoto, et al., 199815. m/0.25 mm/0.25 μm; Program: not specified
CapillaryDB-12595.Nakayama, Yokota, et al., 1996He; Column length: 15. m; Column diameter: 0.258 mm; Program: 130C (2min) => 32C/min => 220C (4min) => 8C/min => 270C (5min)
CapillaryDB-12590.Toyomasu, Tsuji, et al., 1993He; Column length: 15. m; Column diameter: 0.258 mm; Program: 120C(2min) => 16C/min => 216C(5min) => 8C/min => 280C(10min)
CapillaryDB-12596.Tanno, Yokota, et al., 1992Column length: 15. m; Column diameter: 0.258 mm; Program: 130C(2m) => 32C/min => 220(4min) => 8C/min270C(2min)
PackedNonpolar2619.Poling, 1991Program: not specified
PackedNonpolar2620.Poling, 1991Program: not specified
CapillaryBP-12612.Talón, Hedden, et al., 199025. m/0.32 mm/0.33 μm, He; Program: 50C(1min) => 20C/min => 240C => 4C/min => 295C
CapillaryBP-12612.Talón, Hedden, et al., 199025. m/0.32 mm/0.33 μm, He; Program: 50C(1min) => 20C/min => 240C => 4C/min => 295C
CapillaryUltra-22576.Talon, Koornneef, et al., 199025. m/0.32 mm/0.52 μm; Program: 50C => 40C/min => 220C => 6C/min => 280C
CapillaryUltra-22582.Talon, Koornneef, et al., 199025. m/0.32 mm/0.52 μm; Program: 50C => 40C/min => 220C => 6C/min => 280C
CapillaryUltra-22582.Talon, Koornneef, et al., 199025. m/0.32 mm/0.52 μm; Program: 50C => 40C/min => 220C => 6C/min => 280C
CapillaryUltra-22579.Talon and Zeevaart, 199025. m/0.32 mm/0.52 μm, He; Program: 50C => 40C/min => 220C => 6C/min => 280C
CapillaryBP-12625.Hedden, Croker, et al., 198925. m/0.32 mm/0.33 μm, He; Program: 50C(1min) => 20C/min => 240C => 4C/min => 295C
CapillaryBP-12630.Hedden, Croker, et al., 198925. m/0.32 mm/0.33 μm, He; Program: 50C(1min) => 20C/min => 240C => 4C/min => 295C

Van Den Dool and Kratz RI, non-polar column, custom temperature program

View large format table.

Column type Active phase I Reference Comment
CapillaryHP-12600.Kim, Lee, et al., 200330. m/0.25 mm/0.25 μm, He; Program: 60C (1min) => 15C/min => 200C => 5C/min => 285C
CapillaryHP-12600.Kim, Lee, et al., 200330. m/0.25 mm/0.25 μm, He; Program: 60C (1min) => 15C/min => 200C => 5C/min => 285C
CapillaryHP-12605.Pearce, Hutt, et al., 2002Column length: 12. m; Column diameter: 0.22 mm; Program: 60C(0.5min) => 20C/min => 200C => 5C/min => 300C
CapillaryHP-12606.Pearce, Hutt, et al., 2002Column length: 12. m; Column diameter: 0.22 mm; Program: 60C(0.5min) => 20C/min => 200C => 5C/min => 300C
CapillaryDB-52618.Pearce, Hutt, et al., 2002Column length: 15. m; Column diameter: 0.25 mm; Program: 60C(0.5min) => 20C/min => 200C => 5C/min => 300C
CapillaryDB-52620.Pearce, Hutt, et al., 2002Column length: 15. m; Column diameter: 0.25 mm; Program: 60C(0.5min) => 20C/min => 200C => 5C/min => 300C
CapillaryOV-12596.Kobayashi, MacMillan, et al., 2000He; Column length: 25. m; Column diameter: 0.2 mm; Program: 60C(2min) => 13C/min => 150C => 3C/min => 280C(10min)
CapillaryOV-12601.Kobayashi, MacMillan, et al., 2000He; Column length: 25. m; Column diameter: 0.2 mm; Program: 60C(2min) => 13C/min => 150C => 3C/min => 280C(10min)
CapillaryOV-12596.Davis, Kobayashi, et al., 199925. m/0.2 mm/0.25 μm, He; Program: 60C(2min) => 10C/min => 150C => 3C/min => 300C(10min)
CapillaryCP-Sil5 CB MS2627.Roberts, Blake, et al., 1999He; Column length: 25. m; Column diameter: 0.25 mm; Program: 90C(1min) => 20C/min => 220C => 4C/min => 290C
CapillaryCP-Sil5 CB MS2629.Roberts, Blake, et al., 1999He; Column length: 25. m; Column diameter: 0.25 mm; Program: 90C(1min) => 20C/min => 220C => 4C/min => 290C
CapillaryDB-12591.Hisamatsu, Koshioka, et al., 199815. m/0.25 mm/0.33 μm; Program: 120(2min) => (16C/min) => 216(5min) => (8C/min) => 280C
CapillaryOV-12596.Webb, Appleford, et al., 199825. m/0.2 mm/0.25 μm; Program: 60C(2min) => 10C/min => 150C => 3C/min => 300C
CapillaryBP-12607.Webb, Appleford, et al., 199825. m/0.2 mm/0.1 μm; Program: 60C(2min) => 10C/min => 150C => 3C/min => 300C
CapillaryBP-12607.Webb, Appleford, et al., 199825. m/0.2 mm/0.1 μm; Program: 60C(2min) => 10C/min => 150C => 3C/min => 300C
CapillaryDB-12597.Grünzweig, Rabinowitch, et al., 1997He; Column length: 30. m; Column diameter: 0.25 mm; Program: 40C (2min) => 10C/min => 150C => 3C/min => 300C
CapillaryDB-12601.Grünzweig, Rabinowitch, et al., 1997He; Column length: 30. m; Column diameter: 0.25 mm; Program: 40C (2min) => 10C/min => 150C => 3C/min => 300C
CapillaryCP Sil 5 CB2610.Kappers, Jordi, et al., 199730. m/0.25 mm/0.4 μm, He; Program: 200C => 25C/min => 250C => 4C/min => 280C(4min)
CapillaryCP Sil 5 CB2611.Kappers, Jordi, et al., 199730. m/0.25 mm/0.4 μm, He; Program: 200C => 25C/min => 250C => 4C/min => 280C(4min)
CapillaryDB-12598.Rijnders, Yang, et al., 199715. m/0.25 mm/0.25 μm, He; Program: 80C(1min) => 30C/min => 245C => 5C/min => 300C
CapillaryOV-12590.Kobayashi, Spray, et al., 199625. m/0.2 mm/0.25 μm; Program: 50C(2min) => 10C/min => 150C => 3C/min => 300C
CapillaryOV-12600.Kobayashi, Spray, et al., 199625. m/0.2 mm/0.25 μm; Program: 50C(2min) => 10C/min => 150C => 3C/min => 300C
CapillaryOV-12602.Kobayashi, Spray, et al., 199625. m/0.2 mm/0.25 μm; Program: 50C(2min) => 10C/min => 150C => 3C/min => 300C
CapillaryOV-12602.Kobayashi, Spray, et al., 199625. m/0.2 mm/0.25 μm; Program: 50C(2min) => 10C/min => 150C => 3C/min => 300C
CapillaryDB-12596.Ridoutt, Pharis, et al., 199515. m/0.25 mm/0.25 μm, He; Program: 60C(1min) => 20C/min => 200C => 4C/min => 260C
CapillaryDB-12599.Ridoutt, Pharis, et al., 199515. m/0.25 mm/0.25 μm, He; Program: 60C(1min) => 20C/min => 200C => 4C/min => 260C
CapillaryOV-12596.Santes, Hedden, et al., 199525. m/0.2 mm/0.25 μm; Program: 60C(2min) => 10C/min => 150C => 3C/min => 300C
CapillaryOV-12601.Santes, Hedden, et al., 199525. m/0.2 mm/0.25 μm; Program: 60C(2min) => 10C/min => 150C => 3C/min => 300C
CapillaryOV-12608.Talo, Spray, et al., 1995He; Column length: 25. m; Column diameter: 0.2 mm; Program: 60C(2min) => 13C/min => 150C => 3C/min => 280C(10min)
CapillaryOV-12608.Talo, Spray, et al., 1995He; Column length: 25. m; Column diameter: 0.2 mm; Program: 60C(2min) => 13C/min => 150C => 3C/min => 280C(10min)
CapillaryCP Sil 5 CB2627.Blake and Browning, 1994He; Column length: 25. m; Column diameter: 0.25 mm; Program: 50C(1min) => 15C/min => 220C => 2C/min => 300C
CapillaryCP Sil 5 CB2629.Blake and Browning, 1994He; Column length: 25. m; Column diameter: 0.25 mm; Program: 50C(1min) => 15C/min => 220C => 2C/min => 300C
CapillaryBP-12626.Hasan, Ridoutt, et al., 199425. m/0.22 mm/0.25 μm, He; Program: 60C => 30C/min => 240C => 3C/min => 290C
CapillaryBP-12627.Hasan, Ridoutt, et al., 199425. m/0.22 mm/0.25 μm, He; Program: 60C => 30C/min => 240C => 3C/min => 290C
CapillaryDB-12608.Pearce, Koshioka, et al., 199415. m/0.22 mm/0.25 μm; Program: 60(0.1 min)-200 0C at 20 deg/min; 200-300 0C at 5 deg/min
CapillaryCP Sil 5 CB2627.Taylor, Blake, et al., 1994He; Column length: 25. m; Column diameter: 0.25 mm; Program: 60C(0.3min) => 20C/min => 220C => 4C/min => 300C
CapillaryCP Sil 5 CB2629.Taylor, Blake, et al., 1994He; Column length: 25. m; Column diameter: 0.25 mm; Program: 60C(0.3min) => 20C/min => 220C => 4C/min => 300C
CapillarySE-522590.Hedden, Hoad, et al., 199325. m/0.22 mm/0.25 μm, He; Program: 50C => 15C/min => 240C => 4C/min => 300C
CapillarySE-522591.Hedden, Hoad, et al., 199325. m/0.22 mm/0.25 μm, He; Program: 50C => 15C/min => 240C => 4C/min => 300C
CapillaryOV-12595.Waycott, Smith, et al., 199125. m/0.22 mm/0.25 μm; Program: 60C(2min) => 10C/min => 150C => 3C/min => 310C
CapillarySPB-12614.Poling and Maier, 198830. m/0.25 mm/0.25 μm, He; Program: 60C(2min) => 20C/min => 160C => 5C/min => 290C
CapillarySPB-12616.Poling and Maier, 198830. m/0.25 mm/0.25 μm, He; Program: 60C(2min) => 20C/min => 160C => 5C/min => 290C
CapillaryOV-12590.Heupel R.C., Phinney B.O., et al., 1985He; Program: 50C(1min) => 15C/min => 200C => 4C/min => 260C
CapillaryOV-12594.Gaskin, Gilmour, et al., 1984He; Column length: 25. m; Column diameter: 0.2 mm; Program: 60C(2min) => 13C/min => 150C => 3C/min => 280C(10min)

Normal alkane RI, non-polar column, custom temperature program

View large format table.

Column type Active phase I Reference Comment
CapillaryDB-12605.Yamazaki, Nishijima, et al., 200230. m/0.25 mm/0.25 μm, He; Program: 60C92min) => 30C/min => 210C => 2C/min => 280C(5min)
CapillaryDB-52651.Chang, Chen, et al., 2001Column length: 15. m; Column diameter: 0.25 mm
CapillaryDB-12605.Nakayama, Koshioka, et al., 200130. m/0.25 mm/0.25 μm, He; Program: 60C (2min) => 2C/min => 210C => 2C/min => 280C(5min)
CapillaryHP-12629.Fos, Nuez, et al., 200025. m/0.20 mm/0.33 μm, Helium; Program: 60 0C (1 min) 20 0C/min -> 240 0C 4 0C/min -> 300 0C
CapillaryHP-12631.Fos, Nuez, et al., 200025. m/0.20 mm/0.33 μm, Helium; Program: 60 0C (1 min) 20 0C/min -> 240 0C 4 0C/min -> 300 0C
CapillaryMethyl Silicone2637.Martínez-García, Santes, et al., 2000Program: not specified
CapillaryMethyl Silicone2637.Martínez-García, Santes, et al., 2000Program: not specified
CapillaryBP-12597.Pérez, Viani, et al., 200025. m/0.2 mm/0.25 μm; Program: 60C (1min) => 20C/min => 240C => 4C/min => 300C
CapillaryDB-12593.Motosugi, Nishijima, et al., 199615. m/0.25 mm/0.25 μm; Program: not specified
CapillaryDB-12578.Koshioka, Nishijama, et al., 199515. m/0.25 mm/0.25 μm; Program: not specified
CapillaryPolydimethyl siloxane2593.Tanno, Nakayama, et al., 1995Program: not specified
CapillaryPolydimethyl siloxane2593.Tanno, Nakayama, et al., 1995Program: not specified
CapillaryPolydimethyl siloxane2596.Tanno, Nakayama, et al., 1995Program: not specified
CapillaryPolydimethyl siloxane2597.Tanno, Nakayama, et al., 1995Program: not specified
CapillaryDB-12578.Nishijima, Murakami, et al., 199315; Column diameter: 0.257 mm; Phase thickness: 0.25 μm; Program: not specified
CapillaryUltra 22581.Talon, Zacarias, et al., 199222. m/0.32 mm/0.52 μm, Helium; Program: not specified
CapillaryHP-12602.Beall, Morgan, et al., 199112. m/0.2 mm/0.33 μm, He; Program: 60C(1min) => 15C/min => 200C => 5C/min => 270C
CapillaryHP-12599.Matheussen, Morgan, et al., 199112. m/0.2 mm/0.33 μm, He; Program: 60C(1min) => 15C/min => 200C => 5C/min => 270C
CapillaryUltra-22580.Talon, Zeevaart, et al., 199125. m/0.32 mm/0.52 μm; Program: 50C => 40C/min => 220C => 8C/min => 280C
CapillaryDB-12592.Nakayama, Yamane, et al., 1990Helium; Column length: 15. m; Column diameter: 0.258 mm; Program: not specified
CapillaryOV-12590.Yamane, Fujioka, et al., 198825. m/0.20 mm/0.25 μm; Program: not specified

References

Oyama, Yamauchi, et al., 1996
Oyama, N.; Yamauchi, T.; Yamane, H.; Yamaguchi, I.; Schraudolf, H.; Mander, L.N.; Murofushi, N., Gibberellins and antheridiogens in prothallia and sporophytes of Anemia phyllitidis, Biosci. Biotechnol. Biochem., 1996, 60, 2, 301-304, https://doi.org/10.1271/bbb.60.301 . [all data]

Oyama, Yamauchi, et al., 1996, 2
Oyama, N.; Yamauchi, T.; Yamane, H.; Murofushi, N.; Agatsuma, M.; Pour, M.; Mander, L.N., Identification of gibberellins and 9,15-cyclogibberellins in developing apple seeds, Biosci. Biotechnol. Biochem., 1996, 60, 2, 305-308, https://doi.org/10.1271/bbb.60.305 . [all data]

Fujioka, Yamane, et al., 1988
Fujioka, S.; Yamane, H.; Spray, C.R.; Gaskin, P.; Macmillan, J.; Phinney, B.O.; Takahashi, N., Qualitative and quantitative analyses of gibberellins in vegetative shoots of normal, dwarf-1, dwarf-2, dwarf-3, and dwarf-5 seedlings of Zea mays L., Plant Physiol., 1988, 88, 4, 1367-1372, https://doi.org/10.1104/pp.88.4.1367 . [all data]