Pyridine, 2-methyl-5-(1-methylethyl)

Normal alkane RI, non-polar column, temperature ramp

View large format table.

Column type Active phase I Reference Comment
CapillarySPB-11116.Thomas and Bassols, 19925. K/min; Column length: 60. m; Tstart: 80. C; Tend: 230. C

Normal alkane RI, polar column, temperature ramp

View large format table.

Column type Active phase I Reference Comment
CapillarySupelcowax1610.Thomas and Bassols, 19925. K/min; Column length: 60. m; Tstart: 80. C; Tend: 230. C

References

Thomas and Bassols, 1992
Thomas, A.F.; Bassols, F., Occurrence of pyridines and other bases in orange oil, J. Agric. Food Chem., 1992, 40, 11, 2236-2243, https://doi.org/10.1021/jf00023a037 . [all data]