11H-Pyrido[2,1-b]quinazolin-11-one, 6,7,8,9-tetrahydro, 9-methyl

Kovats' RI, non-polar column, isothermal

View large format table.

Column type Active phase Temperature (C) I Reference Comment
PackedOV-1220.2123.Papp, Szász, et al., 1991N2, Chromosorb W AW DMCS; Column length: 1.8 m

References

Papp, Szász, et al., 1991
Papp, O.; Szász, Gy.; Kökösi, J.; Hermecz, I., Correlation between structure and gas chromatographic behaviour of nitrogen-containing heterocyclic compounds. I. Methyl substitution of pyridopyrimidine derivatives, J. Chromatogr., 1991, 537, 365-370, https://doi.org/10.1016/S0021-9673(01)88909-3 . [all data]