Borane, dimethoxy, pentyl

Kovats' RI, non-polar column, isothermal

View large format table.

Column type Active phase Temperature (C) I Reference Comment
PackedSE-3070.968.Haken and Abraham, 1991CH4, Chromosorb WAW DMCS; Column length: 1.5 m

References

Haken and Abraham, 1991
Haken, J.K.; Abraham, F., Gas chromatography of homologous esters. XXXIV. Alkyl borate and boronate esters, J. Chromatogr., 1991, 550, 155-170, https://doi.org/10.1016/S0021-9673(01)88536-8 . [all data]