Cubeb-11-ene

Normal alkane RI, non-polar column, temperature ramp

View large format table.

Column type Active phase I Reference Comment
CapillaryCP-Sil 5 CB1448.Olawore, Usman, et al., 200625. m/0.25 mm/0.15 μm, Hydrogen, 3. K/min; Tstart: 50. C; Tend: 230. C

References

Olawore, Usman, et al., 2006
Olawore, N.O.; Usman, L.A.; Ogunwande, I.A.; Adeleke, K.A., Constituents of rhizome essential oils of two types of Cyperus articulatus L. grown in Nigeria, J. Essent Oil Res., 2006, 18, 6, 604-606, https://doi.org/10.1080/10412905.2006.9699179 . [all data]