epi-β-Selinene

Normal alkane RI, non-polar column, temperature ramp

View large format table.

Column type Active phase I Reference Comment
CapillaryDB-51509.Everaerts, Roisin, et al., 1993Helium, 3. K/min; Column length: 60. m; Column diameter: 0.32 mm; Tstart: 60. C; Tend: 220. C

Normal alkane RI, polar column, temperature ramp

View large format table.

Column type Active phase I Reference Comment
CapillaryDB-Wax1714.Everaerts, Roisin, et al., 1993Helium, 3. K/min; Column length: 60. m; Column diameter: 0.32 mm; Tstart: 60. C; Tend: 220. C

References

Everaerts, Roisin, et al., 1993
Everaerts, C.; Roisin, Y.; Le Quere, J.-L.; Bonnard, O.; Pasteels, J.M., Sesquiterpenes in the frontal gland secretion of nasute soldier termites from New Guinea, J. Chem. Ecol., 1993, 19, 12, 2865-2879, https://doi.org/10.1007/BF00980588 . [all data]