Nordimedrol acetylated
- Formula: C18H21NO2
- Molecular weight: 283.3648
- IUPAC Standard InChIKey: RRLHRDNTUZHNAO-UHFFFAOYSA-N
- Chemical structure:
View 3d structure (requires JavaScript / HTML 5) - Permanent link for this species. Use this link for bookmarking this species for future reference.

Normal alkane RI, non-polar column, custom temperature program

Column type | Active phase | I | Reference | Comment |
---|---|---|---|---|
Capillary | 5 % Phenyl methyl siloxane | 2343. | Grigoriev and Savchuk, 2010 | 25. m/0.20 mm/0.33 μm; Program: 50 0C (0.5 min) 99 0C/min -> 100 0C (1 min) 15 0C/min -> 280 0C (20 min) |
Capillary | 5 % Phenyl methyl siloxane | 2344. | Grigoriev and Savchuk, 2010 | 25. m/0.20 mm/0.33 μm; Program: 50 0C (0.5 min) 99 0C/min -> 100 0C (1 min) 15 0C/min -> 280 0C (20 min) |

References

Grigoriev and Savchuk, 2010
Grigoriev, A.M.; Savchuk, S.A.,
Correlation of the parameters of screening libraries of the gas-chromatographic retention data,
Rus. J. Anal. Chem. (Engl. Transl.), 2010, 65, 4, 388-397. [all data]