Phenol, 2-(1-methylethyl)-4-nitro
- Formula: C9H11NO3
- Molecular weight: 181.1885
- IUPAC Standard InChIKey: YVSKFUMSIJTGTO-UHFFFAOYSA-N
- Chemical structure:
View 3d structure (requires JavaScript / HTML 5) - Permanent link for this species. Use this link for bookmarking this species for future reference.

Kovats' RI, non-polar column, isothermal

Column type | Active phase | Temperature (C) | I | Reference | Comment |
---|---|---|---|---|---|
Packed | E-301 | 150. | 1697. | Verevkin, Belen'kaya, et al., 1990 | He; Column length: 1.0 m |

References

Verevkin, Belen'kaya, et al., 1990
Verevkin, S.P.; Belen'kaya, R.S.; Rozhnov, A.M.; Matyushina, V.P.,
Investigation of the chromatographic behaviour of alkylnitrophenols,
Zh. Anal. Khim., 1990, 45, 1786-1790. [all data]