Oxymesterone (Androst-4-en-17A-methyl-4,17B-diol-3-one), TMS
- Formula: C29H54O3Si3
- Molecular weight: 534.9938
- IUPAC Standard InChIKey: ABKPFKCGRAVRBX-VXLSRJMWSA-N
- Chemical structure:
View 3d structure (requires JavaScript / HTML 5) - Stereoisomers:

Normal alkane RI, non-polar column, custom temperature program

Column type | Active phase | I | Reference | Comment |
---|---|---|---|---|
Capillary | DB-1 | 2984. | Bowers, 1996 | 30. m/0.25 mm/0.25 μm, Helium; Program: 170 0C 20 0C/min -> 260 0C 2.7 0C/min -> 305 0C 20 0C/min -> 320 0C |

References

Bowers, 1996
Bowers, L.D.,
Separation and confirmation of anabolic steroids with quadrupole ion trap tandem mass spectrometry,
J. Chromatogr. B, 1996, 687, 1, 69-78, https://doi.org/10.1016/S0378-4347(96)00231-9
. [all data]