4,5,6,7-Tetrahydropyrazolo[1,5-d][1,2,4]-triazin-4-one, 2,5-dimethyl-7,7-tetramethylene
- Formula: C11H18N4O
- Molecular weight: 222.2868
- IUPAC Standard InChIKey: UURHHYSBRAMJBX-UHFFFAOYSA-N
- Chemical structure:
View 3d structure (requires JavaScript / HTML 5) - Permanent link for this species. Use this link for bookmarking this species for future reference.

Normal alkane RI, non-polar column, isothermal

Column type | Active phase | Temperature (C) | I | Reference | Comment |
---|---|---|---|---|---|
Packed | OV-101 | 220. | 1842. | Bidlo-Igloy, Szederkenyi, et al., 1986 | Nitrogen, Gas-Chrom Q (80-100 mesh); Column length: 2. m |

References

Bidlo-Igloy, Szederkenyi, et al., 1986
Bidlo-Igloy, M.; Szederkenyi, F.; Tihanyi, E.,
Structure-retention correlations of dihydropyrazolo-triazinone derivatives in thin-layer and gas chromatography,
J. Chromatogr., 1986, 365, 145-153, https://doi.org/10.1016/S0021-9673(01)81551-X
. [all data]