Kaempferid, TMS

Normal alkane RI, non-polar column, isothermal

View large format table.

Column type Active phase Temperature (C) I Reference Comment
PackedOV-1210.2737.Katagi, Horii, et al., 1973Nitrogen; Column length: 2. m

References

Katagi, Horii, et al., 1973
Katagi, T.; Horii, A.; Oomura, Y.; Miyakawa, H.; Kyu, T.; Ikeda, Y.; Isoi, K., Gas chromatography of flavonoids, J. Chromatogr., 1973, 79, 45-56, https://doi.org/10.1016/S0021-9673(01)85272-9 . [all data]