13β-Tygloyloxylupanine

Normal alkane RI, non-polar column, custom temperature program

View large format table.

Column type Active phase I Reference Comment
CapillaryDB-12850.El-Shazly, Ateya, et al., 2001Helium; Column length: 15. m; Column diameter: 0.317 mm; Program: 150 0C (2 min) 15 0C/min -> 250 0C 25 0C/min -> 300 0C (5 min)

References

El-Shazly, Ateya, et al., 2001
El-Shazly, A.; Ateya, A.-M.M.; Wink, M., Quinolizidine alkaloid profiles of lupunus varius orientalis. L. albus albus, L. hartwegii, and L. densiflorus, Z. Naturforsch., 2001, 56c, 21-30. [all data]