Methylphosphonic acid, methyl-(4-methyl-2-pentyl) ester

Normal alkane RI, non-polar column, temperature ramp

View large format table.

Column type Active phase I Reference Comment
CapillaryDB-5MS755.Szymanska, Sokolowski, et al., 199630. m/0.25 mm/0.25 μm, He, 40. C @ 2. min, 10. K/min; Tend: 270. C

References

Szymanska, Sokolowski, et al., 1996
Szymanska, A.; Sokolowski, M.; Sliwakowski, M., Mass spectra and retention indices of selected O-alkyl hydrogen methylphosphonates, Biul. Inform. WIChiR 1/26/96, 1996, 1, 26, 53-59. [all data]