allo-Cholanic acid, 12β-hydroxy, Me-TMS

Normal alkane RI, non-polar column, isothermal

View large format table.

Column type Active phase Temperature (C) I Reference Comment
CapillaryOV-1270.3030.Lawson and Setchell, 198818. m/0.20 mm/0.25 μm, He

Normal alkane RI, non-polar column, custom temperature program

View large format table.

Column type Active phase I Reference Comment
CapillaryOV-13030.Iida, Momose, et al., 198718. m/0.20 mm/0.25 μm, He; Program: not specified

Normal alkane RI, polar column, custom temperature program

View large format table.

Column type Active phase I Reference Comment
CapillaryDB-Wax3486.Iida, Momose, et al., 198715. m/0.25 mm/0.25 μm, He; Program: not specified

References

Lawson and Setchell, 1988
Lawson, A.M.; Setchell, K.D.R., Appendix of GC retention indices. List of retention indices foe methyl ester - trimethylsilyl (Me-TMS) ether derivatives of bile acids, The Bile Acids. Vol. 4, Methods and Applications, 1988, 4, 571-575. [all data]

Iida, Momose, et al., 1987
Iida, T.; Momose, T.; Tamura, T.; Matsumoto, T.; Goto, J.; Nambara, T.; Chang, F.C., Capillary gas chromatography of hydroxylated bile acid stereoisomers of the allo and normal series, J. Chromatogr., 1987, 389, 155-164, https://doi.org/10.1016/S0021-9673(01)94419-X . [all data]