cis,trans,cis-Bicyclo[4.4.0]decane, 2,4-dimethyl

Normal alkane RI, non-polar column, isothermal

View large format table.

Column type Active phase Temperature (C) I Reference Comment
CapillarySqualane120.1260.Rang, Kurashova, et al., 1982He; Column length: 50. m; Column diameter: 0.25 mm

Normal alkane RI, polar column, isothermal

View large format table.

Column type Active phase Temperature (C) I Reference Comment
CapillaryPEG-20M120.1404.Rang, Kurashova, et al., 1982He; Column length: 100. m; Column diameter: 0.25 mm

References

Rang, Kurashova, et al., 1982
Rang, S.; Kurashova, E.Kh.; Musaev, I.A.; Strenze, T.V.; Joepera, E.; Eisen, O.; Sanin, P.I., Gas-chromatographic characteristics of stereoisomers of the bicyblo[4.4.0]decane series, Neftekhimiya, 1982, 22, 3, 303-308. [all data]